Hey merhaba ziyaretçi bize destek olmak ister misin ? Hemen Kayıt Ol Seni hiç sıkmadan kayıt edeceğiz endişelenmek bize destek olduğun için teşekkürler.



  • Toplam: 0 Oy - Ortalama: 0
  • 1
  • 2
  • 3
  • 4
  • 5
Unity-Gradle Build Failed!
#1
Öncelikle Selamun Aleyküm

Unity ile ufak bir denemelik proje yaptım bunu androide çıkarmak istiyorum.Önce bir çok SDK hatası verdi bunları hallettim.Şimdi ise Gradle Build Failed diye bir hata alıyorum,bunun ile birlikte bir kaç hata daha aldım hatalar şunlar:

HATA1

CommandInvokationFailure: Gradle build failed. 
C:/Program Files/Java/jdk1.8.0_144\bin\java.exe -classpath "C:\Program Files\Unity\Editor\Data\PlaybackEngines\AndroidPlayer\Tools\gradle\lib\gradle-launcher-4.0.1.jar" org.gradle.launcher.GradleMain "-Dorg.gradle.jvmargs=-Xmx2048m" "assembleRelease"

stderr[

FAILURE: Build failed with an exception.

* Where:
Build file 'C:\Users\FAT�H\Documents\Ekrana Dokun\Temp\gradleOut\build.gradle' line: 20

* What went wrong:
A problem occurred evaluating root project 'gradleOut'.
> Failed to apply plugin [id 'com.android.application']
   > Your project path contains non-ASCII characters. This will most likely cause the build to fail on Windows. Please move your project to a different directory. See Linkleri görüntüleyebilmek için Kayıt ol manız veya Giriş yapmanız gerekiyor.Anlayışınız için teşekkürler.! for details. This warning can be disabled by adding the line 'android.overridePathCheck=true' to gradle.properties file in the project directory.

* Try:
Run with --stacktrace option to get the stack trace. Run with --info or --debug option to get more log output.

BUILD FAILED in 1s
]
stdout[

]
exit code: 1
UnityEditor.Android.Command.WaitForProgramToRun (UnityEditor.Utils.Program p, UnityEditor.Android.WaitingForProcessToExit waitingForProcessToExit, System.String errorMsg)
UnityEditor.Android.Command.Run (System.Diagnostics.ProcessStartInfo psi, UnityEditor.Android.WaitingForProcessToExit waitingForProcessToExit, System.String errorMsg)
UnityEditor.Android.AndroidJavaTools.RunJava (System.String args, System.String workingdir, System.Action`1 progress, System.String error)
UnityEditor.Android.GradleWrapper.Run (System.String workingdir, System.String task, System.Action`1 progress)
Rethrow as GradleInvokationException: Gradle build failed
UnityEditor.Android.GradleWrapper.Run (System.String workingdir, System.String task, System.Action`1 progress)
UnityEditor.Android.PostProcessor.Tasks.BuildGradleProject.Execute (UnityEditor.Android.PostProcessor.PostProcessorContext context)
UnityEditor.Android.PostProcessor.PostProcessRunner.RunAllTasks (UnityEditor.Android.PostProcessor.PostProcessorContext context)
UnityEngine.GUIUtilityTonguerocessEvent(Int32, IntPtr)

HATA 2

Error building Player: 2 errors

HATA 3

Build completed with a result of 'Failed'

UnityEngine.GUIUtilityTonguerocessEvent(Int32, IntPtr)


HATA 4

UnityEditor.BuildPlayerWindow+BuildMethodException: 3 errors

  at UnityEditor.BuildPlayerWindow+DefaultBuildMethods.BuildPlayer (BuildPlayerOptions options) [0x0020e] in C:\buildslave\unity\build\Editor\Mono\BuildPlayerWindowBuildMethods.cs:181 
  at UnityEditor.BuildPlayerWindow.CallBuildMethods (Boolean askForBuildLocation, BuildOptions defaultBuildOptions) [0x00065] in C:\buildslave\unity\build\Editor\Mono\BuildPlayerWindowBuildMethods.cs:88 
UnityEngine.GUIUtilityTonguerocessEvent(Int32, IntPtr)

ARKADAŞLAR HATALAR BUNLAR.MADEMKİ BURASI BİR UNİTY FORUMU,ALLAH RIZASI İÇİN Bİ YARDIM EDİN GINA GELDİ EYW Smile
  Cevapla
#2
Aleykumselam, proje yoluna hata vermiş görnuyor.
Proje klasörunuzu c:\Projects\Unity klasörune kopyalayıp tekrar dener misiniz.
  Cevapla
#3
Selamlar,
Aynı sorunu bende yaşamıştım. Build Settings'den Build System'ı gradle'dan internale çevirirseniz düzelecektir.
  Cevapla
#4
(16-07-2018, Saat: 17:32)Therdy Nickli Kullanıcıdan Alıntı: Linkleri görüntüleyebilmek için Kayıt ol manız veya Giriş yapmanız gerekiyor.Anlayışınız için teşekkürler.!Selamlar,
Aynı sorunu bende yaşamıştım. Build Settings'den Build System'ı gradle'dan internale çevirirseniz düzelecektir.

Benim apkdada aynı hatayı veriyordu bende internal yapmıştım ama internal buildde bi tuhaf oluyor oyun bende gradle tekrar gectim bu sefer build edince şansa bala sıkıntı yaşamadım. Ama araştırmama göre jdk versiyonunu 9 sa yada 8 den buyukse 8 e düşürmeniz gerekmekte galiba daha yüksek sürümler ya desteklenmiyor yada test aşamasında. Çok emin deilim ingilizcem iyi değildir.

Buyrun jdk 8
Linkleri görüntüleyebilmek için Kayıt ol manız veya Giriş yapmanız gerekiyor.Anlayışınız için teşekkürler.!

Buda araştırma ingilizcenizle anlayabilirseniz bakın
Linkleri görüntüleyebilmek için Kayıt ol manız veya Giriş yapmanız gerekiyor.Anlayışınız için teşekkürler.!
  Cevapla
#5
Verdiğiniz bilgi için teşekkürler. Hemen değiştiriyorum.
  Cevapla
#6
Dün aynı sorunu yaşadım sdk nın düzgün kurulduğundan emein ol ayrıca jfknında 8 olması lazım.
  Cevapla


Konu ile Alakalı Benzer Konular
Konular Yazar Yorumlar Okunma Son Yorum
  unity oynu andrid opdimizayonu MHT technic 3 475 23-07-2018, Saat: 16:24
Son Yorum: mtat0640
  Unity 2d pause menu sorunu Metin137 7 653 15-07-2018, Saat: 21:14
Son Yorum: abayir41
  Unıty 3d Clon debrandr 14 2,870 20-05-2017, Saat: 16:29
Son Yorum: debrandr

Hızlı Menü:


Konuyu Okuyanlar: 1 Ziyaretçi